{"text_format":"1","workbook":"xlsx","n_sheets":7,"sheets":["Entrevista","SICATS","Datos","Estados-Mpios","Guía de llenado","Padron","Seguimiento SICATS"],"not_rendered":{"charts":0,"images":6,"macros":1,"external_links":0,"defined_names":38,"comments":2,"pivot_tables":0},"unopened":[],"bounds":{"document_bytes":16777216,"sheet_cells":100000,"rows_first":2000,"rows_last":500,"rows_between":2000,"halvings":0,"cell_chars":16384,"cell_head_chars":4096},"cells_cut":0,"cells_raw":0,"read":"whole","date_system":"1900"}

{"sheet":"Entrevista","index":0,"n_rows":62,"n_cols":12,"rows_kept":62,"cut":false,"hidden":false,"merged":[[60,6,61,11],[59,0,59,4],[58,0,58,4],[29,0,29,2],[28,0,28,2],[28,4,28,8],[29,5,29,11],[46,0,46,11],[57,0,57,4],[57,5,57,8],[57,10,57,11],[52,0,53,1],[54,0,56,11],[52,6,52,7],[53,6,53,7],[52,3,52,5],[52,8,52,11],[53,3,53,5],[53,8,53,11],[60,0,60,4],[30,0,30,2],[51,9,51,11],[51,0,51,8],[49,2,49,4],[25,6,25,7],[26,6,26,7],[26,8,27,11],[26,0,26,2],[27,0,27,2],[27,5,27,7],[25,4,25,5],[26,4,26,5],[48,5,48,11],[30,4,30,7],[31,0,45,11],[30,8,30,11],[28,10,28,11],[49,7,49,11],[50,4,50,11],[50,1,50,2],[23,0,23,11],[24,0,24,11],[15,7,15,8],[15,9,15,11],[21,0,21,11],[22,0,22,11],[20,0,20,1],[20,2,20,3],[19,4,19,5],[20,4,20,5],[19,6,20,6],[19,7,20,7],[19,8,20,8],[19,9,20,11],[47,0,47,11],[48,0,48,4],[25,0,25,3],[25,8,25,11],[16,0,16,1],[16,2,16,3],[16,5,16,7],[12,1,12,2],[12,4,12,5],[16,8,16,9],[16,10,16,11],[17,7,17,8],[17,10,17,11],[18,0,18,11],[17,5,17,6],[17,2,17,3],[14,2,14,4],[14,10,14,11],[10,2,10,3],[0,0,1,11],[2,0,2,11],[3,8,3,11],[4,10,4,11],[6,0,6,1],[6,2,6,5],[6,6,6,7],[6,8,6,11],[5,0,5,11],[59,6,59,11],[10,6,10,7],[11,6,11,7],[19,0,19,1],[19,2,19,3],[7,2,7,5],[7,6,7,7],[7,8,7,11],[7,0,7,1],[8,0,8,11],[9,0,9,11],[10,0,11,1],[14,0,15,0],[15,1,15,2],[15,3,15,6],[10,4,10,5],[11,2,11,3],[11,4,11,5],[10,8,11,8],[12,7,12,8],[13,1,13,5],[13,6,13,7],[13,8,13,11],[12,10,12,11]]}
["Entrevista - Orientación"]
[]
["Dirección de Trabajo Social y Vinculación"]
[null,null,null,null,null,null,null,null,"Fecha"]
[null,null,null,null,null,null,null,null,{"$f":"DAY(TODAY())","v":25},{"$f":"MONTH(TODAY())","v":7},{"$f":"YEAR(TODAY())","v":2017}]
[]
["Servicio y/o Programa",null,null,null,null,null,"Procedencia",null,"Iniciativa Propia"]
["CURP / ID DIF",null,null,null,null,null,"Registro"]
[]
["DATOS GENERALES"]
{"$rows_left_out":53}
{"sheet":"SICATS","index":1,"n_rows":57,"n_cols":13,"rows_kept":57,"cut":false,"hidden":false,"merged":[[50,1,50,4],[52,0,52,12],[51,0,51,13],[50,5,50,6],[50,10,50,13],[50,7,50,8],[53,0,53,13],[54,0,54,4],[54,6,54,13],[55,6,55,13],[56,0,56,8],[56,9,56,12],[55,0,55,4],[46,0,46,4],[46,5,46,13],[49,7,49,8],[49,0,49,1],[49,2,49,6],[47,0,47,13],[48,0,48,13],[49,9,49,13],[45,0,45,13],[36,2,36,13],[37,0,37,2],[44,0,44,4],[44,5,44,13],[36,0,36,1],[40,0,40,1],[38,0,39,1],[38,2,38,8],[39,2,39,8],[39,10,39,13],[38,10,38,13],[40,2,40,7],[40,8,40,13],[41,0,41,7],[41,8,41,13],[10,0,10,13],[11,0,12,0],[11,11,12,11],[11,12,12,13],[12,1,12,3],[11,1,11,3],[11,5,11,8],[12,5,12,8],[7,7,7,11],[8,1,8,5],[8,7,8,11],[6,7,6,11],[7,0,8,0],[7,1,7,5],[0,0,0,13],[1,0,1,13],[2,0,2,13],[3,0,3,13],[5,0,6,0],[5,1,5,5],[5,7,5,11],[6,1,6,5],[9,12,9,13],[9,6,9,7],[9,8,9,9],[9,4,9,5],[9,1,9,2],[13,5,13,13],[17,0,17,13],[14,3,14,7],[13,1,13,4],[15,6,15,7],[15,3,15,5],[15,1,15,2],[14,1,14,2],[14,8,14,9],[16,1,16,3],[16,5,16,9],[16,11,16,13],[15,8,15,9],[13,0,15,0],[42,0,42,2],[42,4,42,13],[43,0,43,13],[14,10,14,13],[15,11,15,13],[33,0,33,13],[34,0,34,13],[35,0,35,13],[32,1,32,13],[18,6,18,7],[18,1,18,5],[18,11,18,13],[19,0,19,13],[20,0,31,13],[18,8,18,9]]}
[]
["Sistema Interinstitucional de"]
["Canalización a Trabajo Social (SICATS)"]
["Dirección de Trabajo Social y Vinculación"]
[]
["De:"]
[null,"Nombre de la Institución",null,null,null,null,null,"Responsable de Trabajo Social"]
["Para:                                                                  "]
[null,"Nombre de la Institución",null,null,null,null,null,"Responsable de Trabajo Social"]
["Nº de canalización",null,null,"2.2.","No. de caso o registro",null,null,null,"Fecha (dd/mm/aaaa)",null,{"$f":"Entrevista!I5","v":25},{"$f":"Entrevista!J5","v":7},{"$f":"Entrevista!K5","v":2017}]
{"$rows_left_out":48}
{"sheet":"Datos","index":2,"n_rows":2486,"n_cols":30,"rows_kept":2486,"cut":false,"hidden":false,"merged":[[1,20,1,21],[0,0,0,1],[0,6,0,7],[0,10,0,11]]}
["Programa",null,"Estado Civil","Código"," Municipio","No.","Estado",null,"Grupo Prioritario","Código","Programa",null,"Apoyos y servicios","Código","Grupo Etareo","Detonantes","Código","Código","PROBLEMÁTICA Y VULNERABILIDAD","DIAGNÓSTICOS",null,null,null,"Escolaridad","Condición de vivienda",null,null,"Edad","Grupo etario","SALUD"]
[1,"Fortalecimiento Socio Familiar","Casada/o",2,"Acatic",1,"Aguascalientes","1","Adolescente en situación de embarazo","16","C.U.",1,"1 Despensa por 2 meses","8.10.1x2","<1","Abandono y desamparo a familiares - personas en estado de discapacidad ",63,null,null,"No. Código ","Concepto",null,"No. Código ","A.P.E.","Crédito hipotecario","Abalá","31.1",-1,"<1","IMSS"]
[1.1000000000000001,"Mano a Mano ","Divorciada/o",3,"Acatlán de Juárez",2,"Baja California","2","Adulto Mayor",3,"F.S.F.",2,"1 Despensa por 3 meses","8.10.1x3","1 a 5","Adicciones           ",2,"Abandono o desamparo   ","P3",null,null,null,null,"Analfabeta","Rentada","Abasolo","5.1",1,"1 a 5","ISSSTE"]
[2,"Casos Urgentes","Madre soltera",7,"Ahualulco de Mercado",3,"Baja California Sur","3","Deportados","9",null,null,"1 Despensa por 4 meses","8.10.1x4","6 a 11","Alteración motora          ",72,"Abuso sexual    ","P15","TS-1.1.1","1.1.1 Familia o persona con problemas relacionados a una insuficiencia alimenticia: Consumo de una alimentación escasa o pobre.","TS-1.1.1",null,"Autodidacta","Propia","Abasolo","11.1",2,"1 a 5","SEDENA"]
[3,"Asistencia Operacional ","Padre Soltero",8,"Amacueca",4,"Campeche","4","Desempleados",19,null,null,"1 Despensa por 5 meses","8.10.1x5","12 a 17","Alteración sensitiva          ",73,"Adicciones     ","P9","TS-1.1.2","1.1.2 Familia o persona con problemas relacionados a una insuficiencia alimenticia:La alimentación es inadecuada por edad o enfermedad.","TS-1.1.2","TS-1.1.1","Preescolar","Prestada","Abasolo","19.1",3,"1 a 5","Seguro Popular"]
[3.1,"Contigo el DIF","Separada/o",6,"Amatitán",5,"Chiapas","7","Enfermos Crónicos",6,null,null,"1 Despensa por 6 meses","8.10.1x6","18 a 44","Asuntos psicosociales - alcoholismo        ",44,"Callejización     ","P2","TS-1.1.3","1.1.3 Familia o persona con problemas relacionados a una insuficiencia alimenticia: Alimentación sin variedad.","TS-1.1.3","TS-1.1.2","Cursa preescolar","Otra","Abasolo","28.1",4,"1 a 5","Centro de Salud"]
[4,"Ventanilla Única","Soltera/o",1,"Ameca",6,"Chihuahua","8","Enfermos Psiquiátricos","7",null,null,"1 Despensa Urgente","8.10.1U","45 a 59","Asuntos psicosociales - drogadicción        ",45,"Contingencias     ","V16","TS-1.1.4","1.1.4 Familia o persona con problemas relacionados a una insuficiencia alimenticia: Malos hábitos alimenticios","TS-1.1.4","TS-1.1.3","Primaria",null,"Abejones","20.1",5,"1 a 5","Servicios Médicos Municipales"]
[5," SICATS","Unión libre",5,"Arandas",8,"Coahuila","5","Indígenas",5,null,null,"2 Despensas por 2 meses","8.10.2x2","60 a 64","Asuntos psicosociales - indigencia        ",50,"Desempleo     ","P10","TS-1.1.5  ","1.1.5   Familia o persona con problemas relacionados a una insuficiencia alimenticia: Mala distribución del ingreso familiar","TS-1.1.5  ","TS-1.1.4","Cursa Primaria",null,"Acacoyagua","7.1",6,"6 a 11","Particular"]
[null,null,"Viuda/o",4,"Atemajac de Brizuela",10,"Colima","6","Indigentes","12",null,null,"2 despensas por 3 meses","8.10.2x3","65 y +","Asuntos psicosociales - pandillerismo        ",47,"Deserción escolar    ","P11","TS-1.1.6    ","1.1.6     Familia o persona con problemas relacionados a una insuficiencia alimenticia: Insuficiencia o carencia de recursos","TS-1.1.6    ","TS-1.1.5  ","Primaria Incompleta",null,"Acajete","21.1",7,"6 a 11","Farmacias Similares"]
[null,null,null,null,"Atengo",11,"Distrito Federal","9","Jornaleros Migrantes","8",null,null,"2 Despensas Urgentes","8.10.2U",null,"Asuntos psicosociales - prostitución        ",46,"Desintegración familiar    ","V9","TS-1.2.1","1.2.1 Familia con integrante (s) ó personas que presentan un diagnóstico médico de desnutrición: Integrante (s) de la familia que ya tienen determinado grado de desnutrición.","TS-1.2.1","TS-1.1.6    ","Secundaria",null,"Acajete","30.1",8,"6 a 11","Homeópata"]
{"$rows_left_out":2477}
{"sheet":"Estados-Mpios","index":3,"n_rows":571,"n_cols":36,"rows_kept":571,"cut":false,"hidden":false,"merged":[]}
["Estados","Aguascalientes","Baja_California","BajaCaliforniaSur","Campeche","Coahuila","Colima","Chiapas","Chihuahua","Distrito_Federal","Durango","Guanajuato","Guerrero","Hidalgo","Jalisco","Mexico","Michoacan","Morelos","Nayarit","Nuevo_Leon","Oaxaca ","Puebla","Queretaro","Quintana_Roo","San_Luis_Potosi","Sinaloa","Sonora","Tabasco","Tamaulipas","Tlaxcala","Veracruz","Yucatan","Zacatecas"]
["Aguascalientes","Aguascalientes","Ensenada","Comondú","Calakmul","Abasolo","Armería","Acacoyagua","Ahumada","Alvaro Obregón","Canatlán","Abasolo","Acapulco de Juárez","Acatlán","Acatic","Acambay","Acuitzio","Amacuzac","Acaponeta","Abasolo","Abejones","Acajete","Amealco de Bonfil","Benito Juárez","Ahualulco","Ahome","Aconchi","Balancán","Abasolo","Acuamanala de Miguel Hidalgo","Acajete","Abalá","Apozol",null,"BajaCaliforniaSur","Los Cabos"]
["Baja_California","Asientos","Mexicali","La Paz","Calkiní","Acuña","Colima","Acala","Aldama","Azcapotzalco","Canelas","Acámbaro","Acatepec","Acaxochitlán","Acatlán de Juárez","Acolman","Aguililla","Atlatlahucan","Ahuacatlán","Agualeguas","Acatlán de Pérez Figueroa","Acateno","Arroyo Seco","Cozumel","Alaquines","Angostura","Agua Prieta","Cárdenas","Aldama","Altzayanca","Acatlán","Acanceh","Apulco"]
["BajaCaliforniaSur","Calvillo","Playas de Rosarito","Loreto","Campeche","Allende","Comala","Acapetahua","Allende","Benito Juárez","Coneto de Comonfort","Allende","Ahuacuotzingo","Actopan","Ahualulco de Mercado","Aculco","Alvaro Obregón","Axochiapan","Amatlán de Cañas","Allende","Animas Trujano","Acatlán","Cadereyta de Montes","Felipe Carrillo Puerto","Aquismón","Badiraguato","Alamos","Centla","Altamira","Amaxac de Guerrero","Acayucan","Akil","Atolinga"]
["Campeche","Cosío","Tecate","Los Cabos","Candelaria","Arteaga","Coquimatlán","Aldama","Aquiles Serdán","Coyoacán","Cuencamé","Apaseo el Alto","Ajuchitlán del Progreso","Agua Blanca de Iturbide","Amacueca","Almoloya de Alquisiras","Angamacutiro","Ayala","Bahía de Banderas","Anáhuac","Asunción Cacalotepec","Acatzingo","Colón","Isla Mujeres","Armadillo de los Infante","Choix","Altar","Centro","Antiguo Morelos","Apetatitlán de Antonio Carvajal","Actopan","Baca","Benito Juárez"]
["Chiapas","El Llano","Tijuana","Mulegé","Carmen","Candela","Cuauhtémoc","Altamirano","Ascensión","Cuajimalpa de Morelos","Durango","Apaseo el Grande","Alcozauca de Guerrero","Ajacuba","Amatitán","Almoloya de Juárez","Angangueo","Coatlán del Río","Compostela","Apodaca","Asunción Cuyotepeji","Acteopan","Corregidora","José María Morelos","Axtla de Terrazas","Concordia","Arivechi","Comalcalco","Burgos","Apizaco","Acula","Bokobá","Calera"]
["Chihuahua","Jesús María",null,null,"Champotón","Castaños","Ixtlahuacán","Amatán","Bachíniva","Cuauhtémoc","El Oro","Atarjea","Alpoyeca","Alfajayucan","Ameca","Almoloya del Río","Apatzingán","Cuautla","Del Nayar","Aramberri","Asunción Ixtaltepec","Ahuacatlán","El Marqués","Lázaro Cárdenas","Cárdenas","Cosalá","Arizpe","Cunduacán","Bustamante","Atlangatepec","Acultzingo","Buctzotz","Cañitas de Felipe Pescador"]
["Coahuila","Pabellón de Arteaga",null,null,"Escárcega","Cuatrociénegas","Manzanillo","Amatenango de la Frontera","Balleza","Gustavo A. Madero","Gómez Palacio","Celaya","Apaxtla","Almoloya","Arandas","Amanalco","Aporo","Cuernavaca","Huajicori","Bustamante","Asunción Nochixtlán","Ahuatlán","Ezequiel Montes","Othón P. Blanco","Catorce","Culiacán","Atil","Emiliano Zapata","Camargo","Benito Juárez","Agua Dulce","Cacalchén","Chalchihuites"]
["Colima","Rincón de Romos",null,null,"Hecelchakán","Escobedo","Minatitlán","Amatenango del Valle","Batopilas","Iztacalco","Gral. Simón Boívar","Comonfort","Arcelia","Apan","Atemajac de Brizuela","Amatepec","Aquila","Emiliano Zapata","Ixtlán del Río","Cadereyta Jiménez","Asunción Ocotlán","Ahuazotepec","Huimilpan","Solidaridad","Cedral","El Fuerte","Bacadéhuachi","Huimanguillo","Casas","Calpulalpan","Alpatláhuac","Calotmul","Concepción del Oro"]
["Distrito_Federal","San Francisco de los Romo",null,null,"Hopelchén","Francisco I. Madero","Tecomán","Angel Albino Corzo","Bocoyna","Iztapalapa","Guadalupe Victoria","Coroneo","Atenango del Río","Atitalaquia","Atengo","Amecameca","Ario","Huitzilac","Jala","Carmen","Asunción Tlacolulita","Ahuehuetitla","Jalpan de Serra",null,"Cerritos","Elota","Bacanora","Jalapa","Ciudad Madero","Chiautempan","Alto Lucero de Gutiérrez Barrios","Cansahcab","Cuauhtémoc"]
{"$rows_left_out":562}
{"sheet":"Guía de llenado","index":4,"n_rows":75,"n_cols":13,"rows_kept":75,"cut":false,"hidden":false,"merged":[[46,2,46,10],[40,1,46,1],[4,1,4,10],[41,2,41,10],[42,2,42,10],[43,2,43,10],[44,2,44,10],[45,2,45,10],[15,2,15,10],[16,2,16,10],[5,2,5,10],[10,2,10,10],[8,2,8,10],[11,2,11,10],[9,2,9,10],[12,2,12,10],[14,2,14,10],[13,2,13,10],[3,1,3,10],[0,1,0,10],[1,1,1,10],[6,2,6,10],[7,2,7,10],[29,2,29,10],[17,2,17,10],[18,2,18,10],[20,2,20,10],[19,2,19,10],[22,2,22,10],[23,2,23,10],[24,2,24,10],[25,2,25,10],[26,2,26,10],[27,2,27,10],[28,2,28,10],[21,2,21,10],[51,2,51,10],[30,2,30,10],[31,2,31,10],[32,2,32,10],[33,2,33,10],[34,2,34,10],[35,2,35,10],[36,2,36,10],[37,2,37,10],[38,2,38,10],[39,2,39,10],[50,2,50,10],[47,2,47,10],[49,1,49,10],[48,2,48,10],[40,2,40,10],[52,2,52,10],[53,2,53,10],[54,2,54,3],[54,4,54,6],[54,7,54,10],[60,2,60,10],[56,2,56,3],[56,4,56,6],[56,7,56,10],[57,2,57,3],[57,4,57,6],[57,7,57,10],[58,2,58,3],[58,4,58,6],[58,7,58,10],[54,1,58,1],[59,2,59,10],[55,2,55,3],[55,4,55,6],[55,7,55,10],[73,2,73,10],[72,2,72,10],[61,2,61,10],[62,2,62,10],[63,2,63,10],[64,2,64,10],[65,2,65,10],[66,2,66,10],[67,2,67,10],[68,2,68,10],[69,2,69,10],[70,2,70,10],[71,2,71,10]]}
[null,"Guía operativa para el llenado de la Entrevista - Orientación"]
[null,"Dirección de Trabajo Social y Vinculación"]
[]
[null,"¿Qué es la entrevista?\nEs la forma especializada de obtener información mediante una conversación de naturaleza profesional que se realiza con el propósito de efectuar una investigación sobre un problema o una cuestión determinada. También tiene la utilidad para informar, orientar, educar y motivar, dependiendo del fin profesional que se persigue.\n\nNota: En la versión para llenado en equipo de cómputo se insertaron listas desplegables en diversos campos, por lo que solo se permitirá la elección de  los ítems disponibles en las listas.\nPara el llenado de la versión impresa hacer caso omiso de las indicaciones que en esta guía hacen referencia a listas desplegables y escribir el dato que se solicita.\n"]
[null,"Antes de iniciar con la aplicación del formato de Entrevista - Orientación, es de suma importancia dar a conocer al usuario que al finalizar la obtención de datos personales será necesario de su parte  poner la firma en la parte inferior del documento, donde se compromete a decir la verdad sobre la información que proporciona, así como a estar enterado del uso de sus datos personales en este Sistema.  Para mayor información puede consultar el Aviso de confidencialidad  en   la página web oficial del Sistema DIF del Estado de Jalisco. http://sistemadif.jalisco.gob.mx"]
[null,"CONCEPTO","ESPACIO PARA REGISTRAR"]
[null,"FECHA  ","De realización de la entrevista: dos dígitos de día, dos de mes y cuatro de año"]
[null," SERVICIO Y/O PROGRAMA ","Elegir de la lista desplegable el nombre del programa  en el que se aplica la entrevista."]
[null,"PROCEDENCIA","Indicar quien canaliza al usuario a nuestro servicio. Ej.: Iniciativa propia  (I. P.), Hospital Civil Fray Antonio Alcalde,  DIF  Guadalajara, Ayuntamiento  de Zapopan, etc."]
[null,"ID - DIF / CURP","Esta clave ID-DIF (Identificación de DIF), la proporciona el  SIEM-DIF (Sistema de Información Estatal y Municipal) al realizar la captura de la información obtenida en la entrevista en este Sistema. \nEn esta misma celda se registra la CURP del beneficiario cuando el tipo de apoyo o servicio solicitado requiere este dato."]
{"$rows_left_out":66}
{"sheet":"Padron","index":5,"n_rows":8,"n_cols":47,"rows_kept":8,"cut":false,"hidden":false,"merged":[[1,2,1,36],[2,2,2,5],[2,15,3,16],[2,17,3,20],[2,21,2,28],[2,29,2,30],[2,31,3,33],[2,34,3,34],[2,35,4,35],[3,6,3,8],[2,36,4,36],[3,9,3,11],[3,12,3,13],[2,6,2,14],[2,44,4,44],[2,45,4,45],[2,46,4,46],[2,40,4,40],[2,41,4,41],[2,42,4,42],[2,43,4,43],[2,39,4,39],[2,37,4,37],[2,38,4,38],[3,28,4,28],[3,26,4,26],[3,27,4,27],[3,29,4,29],[3,30,4,30],[2,0,3,1],[3,2,4,2],[3,3,4,3],[3,4,4,4],[3,5,4,5]]}
[]
[null,null,"PADRON DE DESPENSAS JULIO"]
["Fecha",null,"No. de Expediente",null,null,null,"DATOS DE IDENTIFICACION DEL BENEFICIARIO",null,null,null,null,null,null,null,null,"DE NACIMIENTO",null," Padre o Tutor del beneficiario",null,null,null,"DOMICILIO",null,null,null,null,null,null,null,"DATOS TELEFONICOS",null,"IDENTIDAD",null,null,"DATOS ESCOLARES","Ocupación","Servicio 4 (Despensas)","Servicio 3 (Otros)","Servicio 2 (Otros)","Servicio 1 (Asesoría y Orientación Social)","Problemática o vulnerabilidad","Detonante del problema","Diagnóstico social preliminar","Clasificación de programa","Ingresos","No. De integrantes","Ingreso percapita"]
[null,null,"No. ","Programa","Mes","Año","NOMBRE",null,null,"Fecha de Nacimiento",null,null,"Sexo / Edad",null,"Estado Civil",null,null,null,null,null,null,"Calle/Avenida ","Número","Interior","Colonia","Localidad","Código Postal","Municipio","Estado","Teléfono","Celular"]
["Mes","Día",null,null,null,null,"Apellido Paterno","Apellido Materno","Nombre (s)","Día","Mes","Año","H","M",null,"Municipio ","Estado","Apellido paterno","Apellido materno","Nombre(s)","Parentesco",null,null,null,null,null,null,null,null,null,null,"Nacionalidad","No. Credencial IFE","CURP","Escolaridad"]
[{"$f":"Entrevista!J5","v":7},{"$f":"Entrevista!I5","v":25},0,{"$f":"Entrevista!C7","v":0},{"$f":"Entrevista!J5","v":7},{"$f":"Entrevista!K5","v":2017},{"$f":"Entrevista!C11","v":0},{"$f":"Entrevista!E11","v":0},{"$f":"Entrevista!G11","v":0},{"$f":"IF(ISNUMBER(Entrevista!J11),Entrevista!J11,\"SIN FECHA\")","v":"SIN FECHA"},{"$f":"IF(ISNUMBER(Entrevista!K11),Entrevista!K11,\"SIN FECHA\")","v":"SIN FECHA"},{"$f":"IF(ISNUMBER(Entrevista!L11),Entrevista!L11,\"SIN FECHA\")","v":"SIN FECHA"},{"$f":"IF(Entrevista!B13=\"Hombre\",Entrevista!E13,\"\")","v":""},{"$f":"IF(Entrevista!B13=\"Mujer\",Entrevista!E13,\"\")","v":""},{"$f":"Entrevista!H13","v":0},{"$f":"Entrevista!E17","v":0},{"$f":"Entrevista!C17","v":0},{"$f":"Entrevista!A20","v":0},{"$f":"Entrevista!C20","v":0},{"$f":"Entrevista!E20","v":0},{"$f":"Entrevista!J20","v":0},{"$f":"Entrevista!C15","v":0},{"$f":"Entrevista!G15","v":0},{"$f":"Entrevista!I15","v":0},{"$f":"Entrevista!J16","v":0},null,{"$f":"Entrevista!K15","v":0},{"$f":"Entrevista!K17","v":0},{"$f":"Entrevista!I17","v":0},{"$f":"Entrevista!E18","v":0},null,{"$f":"Entrevista!B18","v":0},null,{"$f":"Entrevista!C8","v":0},{"$f":"Entrevista!I14","v":0},{"$f":"Entrevista!B14","v":0},{"$f":"VLOOKUP(Entrevista!I54,Datos!M26:O36,3)","v":{"$error":"#N/A"}},{"$f":"VLOOKUP(Entrevista!D54,Datos!M13:N22,2)","v":{"$error":"#N/A"}},{"$f":"VLOOKUP(Entrevista!I53,Datos!M13:N22,2)","v":{"$error":"#N/A"}},{"$f":"VLOOKUP(Entrevista!D53,Datos!M13:N13,2)","v":{"$error":"#N/A"}},{"$f":"Entrevista!B50","v":" "},{"$f":"Entrevista!G50","v":" "},{"$f":"Entrevista!D51","v":" "},{"$f":"Entrevista!J52","v":0},{"$f":"Entrevista!D30","v":0},{"$f":"Entrevista!D27","v":0},{"$f":"AS6/AT6/30","v":{"$error":"#DIV/0!"}}]
["O","O","O","O",0,0,0,0,0,0,0,0,0,0,0,0,0,0,0,0,0,0,0,0,0,0,0,0,0,0,0,0,0,0,0,0,0,0,0,0,0,0,0,0]
[5,28,0,0,5,2015,"DF","D","D","SIN FECHA","SIN FECHA","SIN FECHA","","",0,0,0,0,0,0,0,0,0,0,0,null,0,0,0,0,null,0,null,0,0,0,{"$error":"#N/A"},8.11,34.700000000000003,9.24,"P15",10,"TS-1.1.5  ","C.U.",0,0,{"$error":"#DIV/0!"}]

{"sheet":"Seguimiento SICATS","index":6,"n_rows":5,"n_cols":21,"rows_kept":5,"cut":false,"hidden":false,"merged":[[0,3,1,5],[0,8,0,10],[0,16,0,17],[1,9,1,10]]}
[null,null,null,"EDAD",null,null,null,null,"CANALIZACION ",null,null,null,null,null,null,null,"CONTRACANALIZACIÓN"]
[null,null,null,null,null,null,null,null,"INTRA DIF","INTERINSTITUCIONAL"]
["FECHA","N° SICATS   REGISTRO","NOMBRE DEL BENEFICIARIO   ","0 - 17 años     ","18 a 59 años","60 y mas","ESTADO O MUNICIPIO","ORIENTACION ","DIF JALISCO","DIF MUNICIPALES","INSTITUCIONES DE A.S.","AREA","PROBLEMA","APOYO Y/O SERVICIO","TRABAJADOR (A) SOCIAL","AVANCES","FECHA","N°"]
[{"$f":"CONCATENATE(SICATS!K10,\"/\",SICATS!L10,\"/\",SICATS!M10)","v":"25/7/2017"},{"$f":"SICATS!B10","v":0},{"$f":"CONCATENATE(SICATS!B12,\" \",SICATS!E12,\" \",SICATS!F12)","v":"0 0 0"},{"$f":"IF(SICATS!K13<18,SICATS!K13,\"\")","v":0},{"$f":"IF(AND(SICATS!K13>17,SICATS!K13<60),SICATS!K13,\"\")","v":""},{"$f":"IF(SICATS!K13>=60,SICATS!K13,\"\")","v":""},{"$f":"CONCATENATE(SICATS!I16,\" \",SICATS!D16)","v":"0 0"},null,{"$f":"IF(SICATS!D10=1,\"1\",\"\")","v":""},{"$f":"IF(SICATS!D10=2.1,\"1\",\"\")","v":""},{"$f":"IF(SICATS!D10=2.2,\"1\",\"\")","v":""},{"$f":"SICATS!B8","v":0},{"$f":"Entrevista!C50","v":0},{"$f":"SICATS!B33","v":0},{"$f":"SICATS!C50","v":" Martha Gabriela Sandoval Gonzalez"}]
[0,null,null,null,null,null,null,null,null,null,null,null,null,null,null,null,null,0,0,0,0]